Firefly开源社区

[应用开发] RV1126 基于 rockx 实现的 isp 摄像头动态识别 demo

124

积分

0

威望

0

贡献

技术小白

积分
124
发表于 2021-9-24 16:15:30     

好的,重新更新了一遍,这个问题没有了。
回复

使用道具 举报

36

积分

0

威望

0

贡献

技术小白

积分
36
发表于 2021-10-9 19:42:26     
学习一下
回复

使用道具 举报

14

积分

0

威望

0

贡献

技术小白

积分
14
发表于 2021-10-13 17:14:57     
好资料。
回复

使用道具 举报

15

积分

0

威望

0

贡献

技术小白

积分
15
发表于 2021-11-9 09:28:41     
前来围观大佬
回复

使用道具 举报

59

积分

0

威望

0

贡献

技术小白

积分
59
发表于 2021-11-18 11:38:16     
本帖最后由 czx 于 2021-11-18 12:13 编辑

编译源码的时候报错这个
CMake Error at CMakeLists.txt:33 (find_package):
  Could not find a configuration file for package "MiniLogger" that is
  compatible with requested version "".
回复

使用道具 举报

39

积分

0

威望

0

贡献

技术小白

积分
39
发表于 2021-12-21 21:28:26     
学习...............
回复

使用道具 举报

3

积分

0

威望

0

贡献

吃瓜的群众

积分
3
发表于 2021-12-24 11:04:16     
请问这个demo可以用usb摄像头实现吗
回复

使用道具 举报

1万

积分

7

威望

0

贡献

神级创客

Rank: 8Rank: 8

积分
10831

突出贡献

发表于 2021-12-24 14:08:14     
leolee 发表于 2021-12-24 11:04
请问这个demo可以用usb摄像头实现吗

代码是针对isp摄像头的。如果要用usb摄像头,需要自己修改代码实现。
回复

使用道具 举报

149

积分

0

威望

0

贡献

技术小白

积分
149
发表于 2022-1-8 16:21:19     

C40PL 编译 aio-rv1126-xhlpr.mk 报错

本帖最后由 东逝之水 于 2022-1-8 16:24 编辑

我是严格按照文档操作的。但是编译出现如下问题。
我使用的是C40PL机器。sdk也是对应地址下载的。执行./build.sh aio-rv1126-jd4.mk后可以编译。执行aio-rv1126-xhlpr.mk,就出现如下错误。

2022-01-08T16:02:19 rockx_client.cpp:(.text+0xba0): undefined reference to `CARPLATE_RECOG_CODE'
2022-01-08T16:02:19 collect2: error: ld returned 1 exit status
2022-01-08T16:02:19 CMakeFiles/rockx_client.dir/build.make:120: recipe for target 'rockx_client' failed
2022-01-08T16:02:19 make[4]: *** [rockx_client] Error 1
2022-01-08T16:02:19 CMakeFiles/Makefile2:141: recipe for target 'CMakeFiles/rockx_client.dir/all' failed
2022-01-08T16:02:19 make[3]: *** [CMakeFiles/rockx_client.dir/all] Error 2
2022-01-08T16:02:19 Makefile:129: recipe for target 'all' failed
2022-01-08T16:02:19 make[2]: *** [all] Error 2
2022-01-08T16:02:19 package/pkg-generic.mk:228: recipe for target '/home/rv1126/rv1126_camera/rv1126_rv1109_linux_release_20211022/buildroot/output/firefly_rv1126_rv1109_xhlpr/build/xhlpr_app-1.0/.stamp_built' failed
2022-01-08T16:02:19 make[1]: *** [/home/rv1126/rv1126_camera/rv1126_rv1109_linux_release_20211022/buildroot/output/firefly_rv1126_rv1109_xhlpr/build/xhlpr_app-1.0/.stamp_built] Error 2
2022-01-08T16:02:19 /home/rv1126/rv1126_camera/rv1126_rv1109_linux_release_20211022/buildroot/output/firefly_rv1126_rv1109_xhlpr/Makefile:16: recipe for target '_all' failed
2022-01-08T16:02:19 make: *** [_all] Error 2
Command exited with non-zero status 1
回复

使用道具 举报

1万

积分

7

威望

0

贡献

神级创客

Rank: 8Rank: 8

积分
10831

突出贡献

发表于 2022-1-8 18:39:53     
请问更新了 SDK 没?需要将 SDK 更新到最新。
如果已经更新到最新。cat /proc/version看一下信息。
回复

使用道具 举报

您需要登录后才可以回帖 登录 | 立即注册

本版积分规则

Copyright © 2014-2022 中山市天启智能科技有限公司 粤ICP备14022046号
快速回复 返回顶部 返回列表